{"text_format":"1","workbook":"xlsx","n_sheets":14,"sheets":["Disclaimer","READ ME","Freight task analysis","Dashboard A","Dashboard B","Calculations step-by-step","H2 cost calculator","BEV payload calculator","Default scenario references","Saved scenarios","Veh type by distance","vehicle_weight_category_stats 2","vehicle_weight_category_machine","stats output"],"not_rendered":{"charts":6,"images":10,"macros":1,"external_links":0,"defined_names":467,"comments":0,"pivot_tables":0},"unopened":[],"bounds":{"document_bytes":16777216,"sheet_cells":100000,"rows_first":2000,"rows_last":500,"rows_between":2000,"halvings":0,"cell_chars":16384,"cell_head_chars":4096},"cells_cut":0,"cells_raw":0,"read":"whole","date_system":"1900"}

{"sheet":"Disclaimer","index":0,"n_rows":18,"n_cols":2,"rows_kept":18,"cut":false,"hidden":false,"merged":[]}
[]
[null,"Comparison tool qualifications, assumptions and limited conditions"]
[]
[null,"Ara Ake owns, or has a licence to use, all the intellectual property included in this long-distance heavy freight total cost of ownership comparison tool.  The comparison tool is not to be used, reproduced, or distributed for any purpose other than those permitted by the terms of the Creative Commons – Attribution ShareAlike 4.0 International (CC BY-SA 4.0) license. "]
[]
[null,"Ara Ake believes that the information provided by others which is incorporated or reflected in the comparison tool is reliable, but this has not been verified. No warranty is given as to the accuracy of that information. "]
[]
[null,"The results produced by the comparison tool are solely for illustrative purposes and should not be used to forecast or predict actual results. Neither Ara Ake nor NERA accept any responsibility for any results produced by using the comparison tool. No obligation is assumed to revise the comparison tool to reflect changes, events or conditions which occur subsequent to the date on which the comparison tool was first made available on the Ara Ake website. Neither Ara Ake nor NERA have any responsibility for any modifications to, or derivative works based upon, the comparison tool made by any person."]
[]
[null,"The comparison tool is provided for use by businesses within New Zealand. Neither Ara Ake nor NERA have any liability for any use of the comparison tool for non-business purposes or outside of New Zealand. All decisions in connection with the use of the comparison tool or any results produced by the comparison tool are the sole responsibility of the user. "]
{"$rows_left_out":9}
{"sheet":"READ ME","index":1,"n_rows":94,"n_cols":4,"rows_kept":94,"cut":false,"hidden":false,"merged":[]}
[]
[null,"What's new in Version 3.0"]
[]
[null,null,"Version 3.0 of this comparison tool includes the following additions:"]
[null,null,null,"- A new vehicle+fuel combination of Diesel + H2 blend in an ICEV (replacing the blue hyrdogen FCEV option); and"]
[null,null,null,"- Added the cost per tonne of carbon abated for each vehicle+fuel combination on Dashboard A."]
[]
[null,null,"Version 2.0 of this comparison tool included the following additions to Version 1.0:"]
[null,null,null,"- Two new default scenarios to load into the calculator, one for a medium HGV (26t) and one for a smaller HGV (16t); and"]
[null,null,null,"- An option to \"pay for the vehicle\" using a lease cost input instead of purchasing and financing the vehicle."]
{"$rows_left_out":85}
{"sheet":"Freight task analysis","index":2,"n_rows":172,"n_cols":12,"rows_kept":172,"cut":false,"hidden":false,"merged":[[2,1,2,11],[158,1,164,1],[4,1,4,10],[6,1,6,10],[16,1,16,10],[50,1,50,10],[83,1,83,10],[123,1,129,1],[130,1,136,1],[137,1,143,1],[144,1,150,1],[151,1,157,1]]}
[null,null,null,null,null,null,null,null,null,null,null," "]
[null,"Freight task analysis of EROAD data",null,null,null,null,null,null,null,null,null," "]
[null,"For the following analysis of the freight task, we have obtained aggregated vehicle movement data from EROAD regarding commercial freight vehicles from 7.5t and above in 2020."]
[]
[null,"EROAD's fleet tracking service collects data from a large proportion of the commercial road freight industry in New Zealand. Therefore, these aggregations should be largely representative of the overall road freight movement, but note that because these data do not represent the entirety of New Zealand's fleet, there could potentially be subsections of the fleet which are underrepresented or overrepresented in this dataset."]
[]
[null,"First, Figures 1 to 3 show the composition of freight movements across weight bands (as defined directly below) and 100km-increment distance bands (up through a >700km band). Following this breakdown, a table is presented which contains various statistics to help the user define freight trips in Dashboard A for any given weight band and distance band combination."]
[]
[null,"Weight bands in analysis",null,null,null,null,null,null,null,null,null," "]
[]
{"$rows_left_out":163}
{"sheet":"Dashboard A","index":3,"n_rows":189,"n_cols":60,"rows_kept":189,"cut":false,"hidden":false,"merged":[[68,18,69,23],[14,1,16,7],[6,1,13,7],[21,2,25,2],[21,3,25,3],[21,5,25,5],[21,6,25,6],[21,7,25,7],[21,4,25,4],[68,39,69,42],[2,41,3,44],[3,37,4,37],[6,9,7,26],[31,10,31,16],[25,18,26,20],[26,23,27,25],[24,23,25,25],[25,22,26,22],[43,29,43,34],[31,29,31,36],[6,28,7,37],[6,39,7,44],[68,28,69,34],[68,10,69,15],[31,18,31,23]]}
[]
[null,"Total cost of ownership per tonne-kilometre "]
[null,null,null,null,null,null,null,null,null,null,null,null,null,null,null,null,null,null,null,null,null,null,null,null,null,null,null,null,null,null,null,null,null,null,null,null,null,null,null,null,null,"Comparison Tool V3.0"]
[null,"under various fuel sources + vehicle types"]
[]
[]
[null,"This comparison tool presents an estimated total cost of ownership per tonne-km (TCO/tkm) for a variety of alternative fuel+vehicle combinations against a diesel+ICEV truck. Default scenarios for varying truck sizes are presented for ease of use; however, robust, stable and New Zealand-specific data are not readily available for many of the parameters surrounding these technologies. Thus, the default scenario should be interpreted as illustrative, although every effort has been made to reference reliable sources. ",null,null,null,null,null,null,null,"General inputs",null,null,null,null,null,null,null,null,null,null,null,null,null,null,null,null,null,null,"Road User Charges",null,null,null,null,null,null,null,null,null,null,"Cost per tonne of carbon abated"]
[null,null,null,null,null,null,null,null,null,null,null,null,null,null,null,null,null,null,null,null,null,null,null,null,null,null,null,null,null,null,null,null,null,null,null,null,null,null,null,null,null,null,null,null,null,null,null,null,null,null,"BEV switch"]
[]
[null,null,null,null,null,null,null,null,null,null,"Carbon price",null,null,null,null,40.799999999999997,"per tCO2e",null,"Driver days driving/year",null,null,null,null,243,"days",null,null,null,null,null,null,null,null,null,null,null,null,null,null,null,"Green H2 + FCEV",null,{"$f":"IF(FCEV_available=1,'Calculations step-by-step'!G128,\"\")","v":430.29635837828414},"per tonne",null,null,null,null,null,null,0]
{"$rows_left_out":180}
{"sheet":"Dashboard B","index":4,"n_rows":506,"n_cols":33,"rows_kept":506,"cut":false,"hidden":false,"merged":[[257,6,262,6],[284,6,289,6],[23,5,24,20],[26,5,27,20]]}
[]
[null,null,null,null,null,null,null,null,null,null,null,null,"Total cost of ownership per tonne-kilometre ",null,null,null,null,null,null,null,null,null,null,null,null,null," "]
[null,null,null,null,null,null,null,null,null,null,null,null,"under various fuel sources + vehicle types",null,null,null,null,null,null,null,null,null,null,null,null,null," "]
[null,null,null,null,null,null,null,null,null,null,null,null,{"$f":"_xlfn.CONCAT(M32,\"–\",M32+9)","v":"2022–2031"},null,null,null,null,null,null,null,null,null,null,null,null,null," "]
[]
[null,null,null,null,null,null,null,null,null,null,null,null,"TCO/tkm"]
[]
[null,null,null,null,null,null,null,null,null,null,null,null,null,null,null,{"$f":"M32","v":2022},{"$f":"P8+1","v":2023},2024,2025,2026,2027,2028,2029,2030,2031]
[]
[null,null,null,null,null,null,null,null,null,null,null,null,"Green H2 + FCEV",null,null,{"$f":"'Calculations step-by-step'!G126","v":0.10434399167883709},{"$f":"'Calculations step-by-step'!H126","v":0.10148062336856974},{"$f":"'Calculations step-by-step'!I126","v":9.8772039964322128E-2},{"$f":"'Calculations step-by-step'!J126","v":9.6209529635421467E-2},{"$f":"'Calculations step-by-step'!K126","v":9.3784876561526911E-2},{"$f":"'Calculations step-by-step'!L126","v":9.1490332507576544E-2},{"$f":"'Calculations step-by-step'!M126","v":8.9318590036411294E-2},{"$f":"'Calculations step-by-step'!N126","v":8.7262757264272905E-2},{"$f":"'Calculations step-by-step'!O126","v":8.5316334069885036E-2},{"$f":"'Calculations step-by-step'!P126","v":8.347318967301523E-2}]
{"$rows_left_out":497}
{"sheet":"Calculations step-by-step","index":5,"n_rows":167,"n_cols":97,"rows_kept":167,"cut":false,"hidden":false,"merged":[]}
[]
["Step-by-step calculations for year one with underlying formulas"]
["Using calculator inputs"]
[]
[null,"This sheet displays the calculations underlying the TCO/tkm calculations displayed on Dashboard A and as year one on Dashboard B. Shaded cells indicate that a formula underlies the value displayed, while non-shaded cells refer back to the value indicated by the row name. "]
[null,"Select cell to view formula, although note cells are non-editable. Cells with formulas which call on values presented in a Dashboard (i.e., not in this sheet) are either referred to by name or accompanied by a footnote below to describe the underlying calculation. "]
[]
[null,"Fuel cell electric vehicle",null,null,null,null,null,null,null,null,null,null,null,null,null,null,null,null,null,null,"Battery electric vehicle",null,null,null,null,null,null,null,null,null,null,null,null,null,null,null,null,null,null,null,"Internal combustion engine vehicle"]
[]
[null,null,null,null,null,"Green H2 + FCEV",null,null,null,null,null,null,null,null,null,null,null,null,null,null,null,null,null,null,null,"Direct charging + BEV",null,null,null,null,null,null,null,null,null,null,null,null,null,null,null,null,null,"Drop-in biodiesel + ICEV",null,null,null,null,null,null,null,null,null,null,null,null,null,"Conventional biodiesel + ICEV",null,null,null,null,null,null,null,null,null,null,null,null,null,"Diesel + H2 + ICEV",null,null,null,null,null,null,null,null,null,null,null,null,null,"Diesel + ICEV"]
{"$rows_left_out":158}
{"sheet":"H2 cost calculator","index":6,"n_rows":145,"n_cols":20,"rows_kept":145,"cut":false,"hidden":false,"merged":[[3,1,5,14]]}
[]
["Green H2 cost calculator",null,null,null,null,null,null,null,null,null,null,null,null,null,null," "]
[]
[null,"Estimates for the delivered costs of green H2 are calculated here, with cost build-up estimates used as the default input into the Dashboard calculations. The user can override the outputs from this calculator directly below the output estimated cost."]
[]
[]
[null,"Note that the user may select all cells in this sheet to review (such that formulas are transparent), but only white cells with green borders are editable as inputs."]
[]
[null,"Distribution"]
[]
{"$rows_left_out":136}
{"sheet":"BEV payload calculator","index":7,"n_rows":55,"n_cols":20,"rows_kept":55,"cut":false,"hidden":false,"merged":[[3,1,5,14]]}
[]
["BEV payload calculator",null,null,null,null,null,null,null,null,null,null,null,null,null,null," "]
[]
[null,"An estimated BEV payload is calculated here, with the calculated estimate used as the default input into the Dashboard calculations. The user can override the outputs from this calculator directly below the calculated output."]
[]
[]
[null,"Note that the user may select all cells in this sheet to review (such that formulas are transparent), but only white cells with green borders are editable as inputs."]
[]
[null,"BEV payload"]
[]
{"$rows_left_out":46}
{"sheet":"Default scenario references","index":8,"n_rows":253,"n_cols":11,"rows_kept":253,"cut":false,"hidden":false,"merged":[]}
[]
[null,"Default Scenario References"]
[]
[null,"General inputs"]
[null,null,"General"]
[null,null,null,"Parameter","Value",null,"Note","Reference ",null,"Location"]
[null,null,null,"USD exchange rate",0.72,null,"10-year OECD average. Relevant values presented here have exchange rates applied","OECD exhange rates"]
[null,null,null,"EUR exchange rate",0.6,null,"10-year OECD average. Relevant values presented here have exchange rates applied","OECD exhange rates"]
[null,null,null,"Carbon price",40.799999999999997,{"$f":"'Dashboard A'!$Q$10","v":"per tCO2e"},"This uses the target aligned scenario ","Climate Change Commission, Technical assumptions In ENZ energy and transport, 2021",null,"Sheet \"Macro drivers\", cell AH9"]
[null,null,null,"Carbon price, annual change",0.1454,null,"Follows the CCC scenario to the 2030 assumption","Climate Change Commission, Technical assumptions In ENZ energy and transport, 2021",null,"Sheet \"Macro drivers\", cell AQ9"]
{"$rows_left_out":244}
{"sheet":"Saved scenarios","index":9,"n_rows":193,"n_cols":33,"rows_kept":193,"cut":false,"hidden":false,"merged":[[1,1,1,4],[13,3,13,4],[14,3,14,4],[3,9,3,12],[1,6,1,17],[16,3,16,4],[2,1,3,4],[6,1,7,4],[4,1,5,4],[8,1,9,4],[10,1,10,4]]}
[]
[null,"Saving scenarios",null,null,null,null,"Options"]
[null,"Use the options to save scenarios for later or to compare scenarios, load scenarios and clear saved scenarios. "]
[null,null,null,null,null,null,null,null,null,null,null,null,null,"Name or description of scenario (limit 50 characters)"]
[null,"To save the current scenario inputs in Dashboard A, write a description in the description box and click 'Save current scenario'."]
[null,null,null,null,null,null,null,null,null,null,"Scenario number to load"]
[null,"To load a scenario, enter the scenario number into the input box and click 'Load scenario'."]
[null,null,null,null,null,null,null,null,null,null,"Scenario number to clear"]
[null,"To clear one specific saved scenario, enter the scenario number into the input box and click 'Clear scenario'."]
[null,null,null,null,null,null,null,null,null,"Caution - will clear all scenarios saved"]
{"$rows_left_out":184}
{"sheet":"Veh type by distance","index":10,"n_rows":66,"n_cols":13,"rows_kept":66,"cut":false,"hidden":true,"merged":[]}
[]
[null,"Percent of all trips taken within a distance band by each weight band "]
[]
[]
[]
[]
[null,null,null,"weight band","700km+","600-700km","500-600km","400-500km","300-400km","200-300km","100-200km","0-100km"]
[null,null,null,"3.5t - 7.5t",{"$f":"SUMIFS('vehicle_weight_category_stats 2'!$D$2:$D$337,'vehicle_weight_category_stats 2'!$A$2:$A$337,$D8,'vehicle_weight_category_stats 2'!$B$2:$B$337,E$7,'vehicle_weight_category_stats 2'!$E$2:$E$337,'vehicle_weight_category_stats 2'!$E$2)","v":16},{"$f":"SUMIFS('vehicle_weight_category_stats 2'!$D$2:$D$337,'vehicle_weight_category_stats 2'!$A$2:$A$337,$D8,'vehicle_weight_category_stats 2'!$B$2:$B$337,F$7,'vehicle_weight_category_stats 2'!$E$2:$E$337,'vehicle_weight_category_stats 2'!$E$2)","v":20},{"$f":"SUMIFS('vehicle_weight_category_stats 2'!$D$2:$D$337,'vehicle_weight_category_stats 2'!$A$2:$A$337,$D8,'vehicle_weight_category_stats 2'!$B$2:$B$337,G$7,'vehicle_weight_category_stats 2'!$E$2:$E$337,'vehicle_weight_category_stats 2'!$E$2)","v":44},{"$f":"SUMIFS('vehicle_weight_category_stats 2'!$D$2:$D$337,'vehicle_weight_category_stats 2'!$A$2:$A$337,$D8,'vehicle_weight_category_stats 2'!$B$2:$B$337,H$7,'vehicle_weight_category_stats 2'!$E$2:$E$337,'vehicle_weight_category_stats 2'!$E$2)","v":205},{"$f":"SUMIFS('vehicle_weight_category_stats 2'!$D$2:$D$337,'vehicle_weight_category_stats 2'!$A$2:$A$337,$D8,'vehicle_weight_category_stats 2'!$B$2:$B$337,I$7,'vehicle_weight_category_stats 2'!$E$2:$E$337,'vehicle_weight_category_stats 2'!$E$2)","v":1210},{"$f":"SUMIFS('vehicle_weight_category_stats 2'!$D$2:$D$337,'vehicle_weight_category_stats 2'!$A$2:$A$337,$D8,'vehicle_weight_category_stats 2'!$B$2:$B$337,J$7,'vehicle_weight_category_stats 2'!$E$2:$E$337,'vehicle_weight_category_stats 2'!$E$2)","v":7201},{"$f":"SUMIFS('vehicle_weight_category_stats 2'!$D$2:$D$337,'vehicle_weight_category_stats 2'!$A$2:$A$337,$D8,'vehicle_weight_category_stats 2'!$B$2:$B$337,K$7,'vehicle_weight_category_stats 2'!$E$2:$E$337,'vehicle_weight_category_stats 2'!$E$2)","v":36722},{"$f":"SUMIFS('vehicle_weight_category_stats 2'!$D$2:$D$337,'vehicle_weight_category_stats 2'!$A$2:$A$337,$D8,'vehicle_weight_category_stats 2'!$B$2:$B$337,L$7,'vehicle_weight_category_stats 2'!$E$2:$E$337,'vehicle_weight_category_stats 2'!$E$2)","v":227495}]
[null,null,null,"7.5 - 10t",{"$f":"SUMIFS('vehicle_weight_category_stats 2'!$D$2:$D$337,'vehicle_weight_category_stats 2'!$A$2:$A$337,$D9,'vehicle_weight_category_stats 2'!$B$2:$B$337,E$7,'vehicle_weight_category_stats 2'!$E$2:$E$337,'vehicle_weight_category_stats 2'!$E$2)","v":15},{"$f":"SUMIFS('vehicle_weight_category_stats 2'!$D$2:$D$337,'vehicle_weight_category_stats 2'!$A$2:$A$337,$D9,'vehicle_weight_category_stats 2'!$B$2:$B$337,F$7,'vehicle_weight_category_stats 2'!$E$2:$E$337,'vehicle_weight_category_stats 2'!$E$2)","v":10},{"$f":"SUMIFS('vehicle_weight_category_stats 2'!$D$2:$D$337,'vehicle_weight_category_stats 2'!$A$2:$A$337,$D9,'vehicle_weight_category_stats 2'!$B$2:$B$337,G$7,'vehicle_weight_category_stats 2'!$E$2:$E$337,'vehicle_weight_category_stats 2'!$E$2)","v":75},{"$f":"SUMIFS('vehicle_weight_category_stats 2'!$D$2:$D$337,'vehicle_weight_category_stats 2'!$A$2:$A$337,$D9,'vehicle_weight_category_stats 2'!$B$2:$B$337,H$7,'vehicle_weight_category_stats 2'!$E$2:$E$337,'vehicle_weight_category_stats 2'!$E$2)","v":340},{"$f":"SUMIFS('vehicle_weight_category_stats 2'!$D$2:$D$337,'vehicle_weight_category_stats 2'!$A$2:$A$337,$D9,'vehicle_weight_category_stats 2'!$B$2:$B$337,I$7,'vehicle_weight_category_stats 2'!$E$2:$E$337,'vehicle_weight_category_stats 2'!$E$2)","v":1359},{"$f":"SUMIFS('vehicle_weight_category_stats 2'!$D$2:$D$337,'vehicle_weight_category_stats 2'!$A$2:$A$337,$D9,'vehicle_weight_category_stats 2'!$B$2:$B$337,J$7,'vehicle_weight_category_stats 2'!$E$2:$E$337,'vehicle_weight_category_stats 2'!$E$2)","v":6251},{"$f":"SUMIFS('vehicle_weight_category_stats 2'!$D$2:$D$337,'vehicle_weight_category_stats 2'!$A$2:$A$337,$D9,'vehicle_weight_category_stats 2'!$B$2:$B$337,K$7,'vehicle_weight_category_stats 2'!$E$2:$E$337,'vehicle_weight_category_stats 2'!$E$2)","v":28491},{"$f":"SUMIFS('vehicle_weight_category_stats 2'!$D$2:$D$337,'vehicle_weight_category_stats 2'!$A$2:$A$337,$D9,'vehicle_weight_category_stats 2'!$B$2:$B$337,L$7,'vehicle_weight_category_stats 2'!$E$2:$E$337,'vehicle_weight_category_stats 2'!$E$2)","v":152431}]
[null,null,null,"10 - 20t",{"$f":"SUMIFS('vehicle_weight_category_stats 2'!$D$2:$D$337,'vehicle_weight_category_stats 2'!$A$2:$A$337,$D10,'vehicle_weight_category_stats 2'!$B$2:$B$337,E$7,'vehicle_weight_category_stats 2'!$E$2:$E$337,'vehicle_weight_category_stats 2'!$E$2)","v":175},{"$f":"SUMIFS('vehicle_weight_category_stats 2'!$D$2:$D$337,'vehicle_weight_category_stats 2'!$A$2:$A$337,$D10,'vehicle_weight_category_stats 2'!$B$2:$B$337,F$7,'vehicle_weight_category_stats 2'!$E$2:$E$337,'vehicle_weight_category_stats 2'!$E$2)","v":318},{"$f":"SUMIFS('vehicle_weight_category_stats 2'!$D$2:$D$337,'vehicle_weight_category_stats 2'!$A$2:$A$337,$D10,'vehicle_weight_category_stats 2'!$B$2:$B$337,G$7,'vehicle_weight_category_stats 2'!$E$2:$E$337,'vehicle_weight_category_stats 2'!$E$2)","v":847},{"$f":"SUMIFS('vehicle_weight_category_stats 2'!$D$2:$D$337,'vehicle_weight_category_stats 2'!$A$2:$A$337,$D10,'vehicle_weight_category_stats 2'!$B$2:$B$337,H$7,'vehicle_weight_category_stats 2'!$E$2:$E$337,'vehicle_weight_category_stats 2'!$E$2)","v":2971},{"$f":"SUMIFS('vehicle_weight_category_stats 2'!$D$2:$D$337,'vehicle_weight_category_stats 2'!$A$2:$A$337,$D10,'vehicle_weight_category_stats 2'!$B$2:$B$337,I$7,'vehicle_weight_category_stats 2'!$E$2:$E$337,'vehicle_weight_category_stats 2'!$E$2)","v":8813},{"$f":"SUMIFS('vehicle_weight_category_stats 2'!$D$2:$D$337,'vehicle_weight_category_stats 2'!$A$2:$A$337,$D10,'vehicle_weight_category_stats 2'!$B$2:$B$337,J$7,'vehicle_weight_category_stats 2'!$E$2:$E$337,'vehicle_weight_category_stats 2'!$E$2)","v":33207},{"$f":"SUMIFS('vehicle_weight_category_stats 2'!$D$2:$D$337,'vehicle_weight_category_stats 2'!$A$2:$A$337,$D10,'vehicle_weight_category_stats 2'!$B$2:$B$337,K$7,'vehicle_weight_category_stats 2'!$E$2:$E$337,'vehicle_weight_category_stats 2'!$E$2)","v":133445},{"$f":"SUMIFS('vehicle_weight_category_stats 2'!$D$2:$D$337,'vehicle_weight_category_stats 2'!$A$2:$A$337,$D10,'vehicle_weight_category_stats 2'!$B$2:$B$337,L$7,'vehicle_weight_category_stats 2'!$E$2:$E$337,'vehicle_weight_category_stats 2'!$E$2)","v":448989}]
{"$rows_left_out":57}
{"sheet":"vehicle_weight_category_stats 2","index":11,"n_rows":337,"n_cols":11,"rows_kept":337,"cut":false,"hidden":true,"merged":[]}
["Vehicle Weight Category","Distance Band","Machine Count","Trip Count","Metric","Min","p_25","Median","Mean","p_75","Max"]
["30t+","0-100km",3635,105924,"Count of Days Driving",1,24,47,52,72,160]
["20 - 25t","0-100km",9992,524287,"Daily kms Travelled",0,12,33,38,60,98]
["20 - 25t","0-100km",9992,524287,"Length of Stops(mins)",15,18,22,27,29,95]
["20 - 25t","0-100km",9992,524287,"Minutes Driving",1,30,61,70,98,216]
["20 - 25t","0-100km",9992,524287,"Number of Stops",1,1,1,2,2,8]
["20 - 25t","0-100km",9992,524287,"Speed",0,20,32,31,42,66]
["20 - 25t","0-100km",9992,524287,"Trip Time(mins)",16,73,129,163,214,572]
["10 - 20t","0-100km",8033,448989,"Count of Days Driving",1,43,80,93,129,316]
["10 - 20t","0-100km",8033,448989,"Daily kms Travelled",0,12,31,37,58,98]
{"$rows_left_out":328}
{"sheet":"vehicle_weight_category_machine","index":12,"n_rows":7,"n_cols":2,"rows_kept":7,"cut":false,"hidden":true,"merged":[]}
["Vehicle Weight Category","Machine Count"]
["3.5t - 7.5t",5217]
["7.5 - 10t",2580]
["10 - 20t",8098]
["20 - 25t",10090]
["25 - 30t",5561]
["30t+",3727]

{"sheet":"stats output","index":13,"n_rows":49,"n_cols":16,"rows_kept":49,"cut":false,"hidden":true,"merged":[]}
["vehicleweightcategory","distanceband","machinecount","tripcount","tot_machines","mean_count_of_days_driving","mean_daily_kms_travelled","mean_length_of_stops","mean_minutes_driving","mean_number_of_stops","mean_speed","mean_trip_time","tot_trips","perc_trips","tot_days","perc_days"]
["10 - 20t","0-100km",8033,448989,8098,93,37,30,72,2,31,185,628765,0.71408077739696074,222,0.41891891891891891]
["10 - 20t","100-200km",4850,133445,8098,51,139,28,198,3,45,396,628765,0.21223350536368912,222,0.22972972972972974]
["10 - 20t","200-300km",2451,33207,8098,29,239,27,289,3,53,494,628765,5.2813054161729739E-2,222,0.13063063063063063]
["10 - 20t","300-400km",1074,8813,8098,17,340,27,359,3,60,558,628765,1.4016365414741596E-2,222,7.6576576576576572E-2]
["10 - 20t","400-500km",454,2971,8098,14,436,28,421,3,64,599,628765,4.725135782048937E-3,222,6.3063063063063057E-2]
["10 - 20t","500-600km",188,847,8098,8,546,29,507,3,66,691,628765,1.3470851590021708E-3,222,3.6036036036036036E-2]
["10 - 20t","600-700km",97,318,8098,5,640,35,591,3,68,771,628765,5.0575334186858363E-4,222,2.2522522522522521E-2]
["10 - 20t","700km+",57,175,8098,5,779,36,708,4,68,1002,628765,2.783233799591262E-4,222,2.2522522522522521E-2]
["20 - 25t","0-100km",9992,524287,10090,72,38,27,70,2,31,163,836129,0.62704080351237668,203,0.35467980295566504]
{"$rows_left_out":39}